{"text_format":"1","workbook":"xlsx","n_sheets":5,"sheets":["start","berekening afstand","lossingen kbdk 200321","meters per minuut","snelheidstabel"],"not_rendered":{"charts":0,"images":0,"macros":1,"external_links":0,"defined_names":2,"comments":0,"pivot_tables":0},"unopened":[],"bounds":{"document_bytes":16777216,"sheet_cells":100000,"rows_first":2000,"rows_last":500,"rows_between":2000,"halvings":0,"cell_chars":16384,"cell_head_chars":4096},"cells_cut":0,"cells_raw":0,"read":"whole","date_system":"1900"}

{"sheet":"start","index":0,"n_rows":13,"n_cols":11,"rows_kept":13,"cut":false,"hidden":false,"merged":[[12,2,15,4],[2,2,2,6],[7,5,8,6],[6,10,7,13],[9,10,10,11],[9,13,10,13]]}
[]
[]
[null,null,"Vul deze 4 vakken in om de afstanden te update."]
[]
[null,null,"Voornaam + naam :",null,null,"coordinaat 1 :"]
[]
[null,null,"Gemeente :",null,null,"coordinaat 2 :",null,null,null,null,"Voor de snelheden van 1 vlucht : kies een vlucht uit de lijst hieronder en vul de lossingsuur (00:00)"]
[null,null,null,null,null,"(+ of - tekenen en 1 cijfer achter de komma zijn verplicht ! )"]
[]
[]
[]
[]
[null,null,"LUKT HET NIET ?        Stuur dan een email naar : michel.de.meuter@telenet.be     met uw naam voornaam gemeente en coordinaten."]

{"sheet":"berekening afstand","index":1,"n_rows":54,"n_cols":19,"rows_kept":54,"cut":false,"hidden":false,"merged":[[2,0,2,1],[3,0,3,1]]}
["COORDINATEN LIEFHEBBER"]
[null,null,null,"(+ of - teken verplicht ! )",null,null,1.7453292519942779E-2,6.7394967422767004E-3,0.99664718933524998,6378137]
[{"$f":"start!D5","v":0},null,"coord 1 :",{"$f":"start!G5","v":0},null,null,{"$f":"SIGN(VALUE(D3))*(VALUE(MID(D3,2,2))+VALUE(MID(D3,4,2))/60+VALUE(MID(D3,6,5))/3600)*$G$2","v":{"$error":"#VALUE!"}}]
[{"$f":"start!D7","v":0},null,"coord 2 :",{"$f":"start!G7","v":0},null,null,{"$f":"SIGN(VALUE(D4))*(VALUE(MID(D4,2,2))+VALUE(MID(D4,4,2))/60+VALUE(MID(D4,6,5))/3600)*$G$2","v":{"$error":"#VALUE!"}}]
[]
[null,null,"2020-01-20"]
["Lossingsplaats","ligging","validatie","coord 1","coord2","aftand","Kolom2","Kolom3","Kolom4","Kolom5","Kolom6","Kolom7","Kolom8","Kolom9","Kolom10","Kolom11"]
["AGEN","(Hippodrome)",1,"+435318,0","+010023,0",{"$f":"($J$2/L8)*(ATAN(-P8/SQRT(1-P8^2))+2*ATAN(1))","v":{"$error":"#VALUE!"}},{"$f":"SIGN(VALUE(D8))*(VALUE(MID(D8,2,2))+VALUE(MID(D8,4,2))/60+VALUE(MID(D8,6,5))/3600)*$G$2","v":0.76599591987942206},{"$f":"SIGN(VALUE(E8))*(VALUE(MID(E8,2,2))+VALUE(MID(E8,4,2))/60+VALUE(MID(E8,6,5))/3600)*$G$2","v":1.756479966659797E-2},{"$f":"($G$3+G8)/2","v":{"$error":"#VALUE!"}},{"$f":"H8-$G$4","v":{"$error":"#VALUE!"}},{"$f":"$H$2*COS(I8)^2","v":{"$error":"#VALUE!"}},{"$f":"SQRT(1+K8)","v":{"$error":"#VALUE!"}},{"$f":"L8*J8","v":{"$error":"#VALUE!"}},{"$f":"ATAN($I$2*TAN($G$3))","v":{"$error":"#VALUE!"}},{"$f":"ATAN($I$2*TAN(G8))","v":0.7643180744872361},{"$f":"SIN(N8)*SIN(O8)+COS(N8)*COS(O8)*COS(M8)","v":{"$error":"#VALUE!"}}]
["ANGOULEME",null,1,"+453442,0","+000232,0",{"$error":"#VALUE!"},0.79549198423812528,7.3691679528647286E-4,{"$error":"#VALUE!"},{"$error":"#VALUE!"},{"$error":"#VALUE!"},{"$error":"#VALUE!"},{"$error":"#VALUE!"},{"$error":"#VALUE!"},0.79381305068193664,{"$error":"#VALUE!"}]
["ARGENTON",null,1,"+463519,0","+013135,0",{"$error":"#VALUE!"},0.81312465782007859,2.6640511776968211E-2,{"$error":"#VALUE!"},{"$error":"#VALUE!"},{"$error":"#VALUE!"},{"$error":"#VALUE!"},{"$error":"#VALUE!"},{"$error":"#VALUE!"},0.81144786411408154,{"$error":"#VALUE!"}]
["AURILLAC",null,1,"+445503,0","+022547,0",{"$error":"#VALUE!"},0.78395826676452973,4.2406652686649851E-2,{"$error":"#VALUE!"},{"$error":"#VALUE!"},{"$error":"#VALUE!"},{"$error":"#VALUE!"},{"$error":"#VALUE!"},{"$error":"#VALUE!"},0.78227906303980488,{"$error":"#VALUE!"}]
["BARCELONA","(2018)",1,"+412407,0","+014525,0",{"$error":"#VALUE!"},0.72260024728330874,3.0664465330177242E-2,{"$error":"#VALUE!"},{"$error":"#VALUE!"},{"$error":"#VALUE!"},{"$error":"#VALUE!"},{"$error":"#VALUE!"},{"$error":"#VALUE!"},0.72093460567698786,{"$error":"#VALUE!"}]
["BERGERAC",null,1,"+445048,0","+003024,0",{"$error":"#VALUE!"},0.78272199187770053,8.8430015434376747E-3,{"$error":"#VALUE!"},{"$error":"#VALUE!"},{"$error":"#VALUE!"},{"$error":"#VALUE!"},{"$error":"#VALUE!"},{"$error":"#VALUE!"},0.7810428122142985,{"$error":"#VALUE!"}]
["BLOIS",null,1,"+473442,0","+012042,0",{"$error":"#VALUE!"},0.83039856927801081,2.3474678439323035E-2,{"$error":"#VALUE!"},{"$error":"#VALUE!"},{"$error":"#VALUE!"},{"$error":"#VALUE!"},{"$error":"#VALUE!"},{"$error":"#VALUE!"},0.82872589437488076,{"$error":"#VALUE!"}]
["BOURGES",null,1,"+470548,0","+022331,0",{"$error":"#VALUE!"},0.82199190004757183,4.1747306080340905E-2,{"$error":"#VALUE!"},{"$error":"#VALUE!"},{"$error":"#VALUE!"},{"$error":"#VALUE!"},{"$error":"#VALUE!"},{"$error":"#VALUE!"},0.82031697085191058,{"$error":"#VALUE!"}]
["BRIVE",null,1,"+451036,0","+012837,0",{"$error":"#VALUE!"},0.78848157840928157,2.5777543424593267E-2,{"$error":"#VALUE!"},{"$error":"#VALUE!"},{"$error":"#VALUE!"},{"$error":"#VALUE!"},{"$error":"#VALUE!"},{"$error":"#VALUE!"},0.7868023741424478,{"$error":"#VALUE!"}]
["CAHORS",null,1,"+443040,0","+012630,0",{"$error":"#VALUE!"},0.77686544260989754,2.5161830049584173E-2,{"$error":"#VALUE!"},{"$error":"#VALUE!"},{"$error":"#VALUE!"},{"$error":"#VALUE!"},{"$error":"#VALUE!"},{"$error":"#VALUE!"},0.77518651642426983,{"$error":"#VALUE!"}]
["CHATEAUROUX","(Parc des Loisirs)",1,"+464918,0","+014146,0",{"$error":"#VALUE!"},0.81719224460458761,2.9602723368547391E-2,{"$error":"#VALUE!"},{"$error":"#VALUE!"},{"$error":"#VALUE!"},{"$error":"#VALUE!"},{"$error":"#VALUE!"},{"$error":"#VALUE!"},0.81551624072841156,{"$error":"#VALUE!"}]
["CHEVRAIN","CHEVRAINVILLIERS",1,"+481436,0","+023614,0",{"$error":"#VALUE!"},0.84200500880377271,4.5446434467206559E-2,{"$error":"#VALUE!"},{"$error":"#VALUE!"},{"$error":"#VALUE!"},{"$error":"#VALUE!"},{"$error":"#VALUE!"},{"$error":"#VALUE!"},0.84033622346896608,{"$error":"#VALUE!"},null,null," "]
["FAY-AUX-LOGES",null,1,"+475440,0","+020808,0",{"$error":"#VALUE!"},0.83620663717770294,3.7272475803700023E-2,{"$error":"#VALUE!"},{"$error":"#VALUE!"},{"$error":"#VALUE!"},{"$error":"#VALUE!"},{"$error":"#VALUE!"},{"$error":"#VALUE!"},0.83453579608900397,{"$error":"#VALUE!"}]
["FLEURUS","(Brye)",1,"+503140,2","+043310,0",{"$error":"#VALUE!"},0.88187705556558205,7.9460962333850596E-2,{"$error":"#VALUE!"},{"$error":"#VALUE!"},{"$error":"#VALUE!"},{"$error":"#VALUE!"},{"$error":"#VALUE!"},{"$error":"#VALUE!"},0.88022846989441317,{"$error":"#VALUE!"}]
["GEMBLOUX","(Les Isnes)",1,"+503018,0","+044328,0",{"$error":"#VALUE!"},0.88147853871971005,8.2457110883107448E-2,{"$error":"#VALUE!"},{"$error":"#VALUE!"},{"$error":"#VALUE!"},{"$error":"#VALUE!"},{"$error":"#VALUE!"},{"$error":"#VALUE!"},0.87982969900276509,{"$error":"#VALUE!"}]
["GUERET",null,1,"+460935,0","+015257,0",{"$error":"#VALUE!"},0.80563913458374758,3.2855823168792285E-2,{"$error":"#VALUE!"},{"$error":"#VALUE!"},{"$error":"#VALUE!"},{"$error":"#VALUE!"},{"$error":"#VALUE!"},{"$error":"#VALUE!"},0.80396117749378071,{"$error":"#VALUE!"}]
["ISSOUDUN",null,1,"+465658,0","+020021,0",{"$error":"#VALUE!"},0.81942238753769114,3.5008395912918558E-2,{"$error":"#VALUE!"},{"$error":"#VALUE!"},{"$error":"#VALUE!"},{"$error":"#VALUE!"},{"$error":"#VALUE!"},{"$error":"#VALUE!"},0.81774686379911021,{"$error":"#VALUE!"}]
["JARNAC",null,1,"+454405,0","-000931,0",{"$error":"#VALUE!"},0.79822148526277192,-2.7682861191353682E-3,{"$error":"#VALUE!"},{"$error":"#VALUE!"},{"$error":"#VALUE!"},{"$error":"#VALUE!"},{"$error":"#VALUE!"},{"$error":"#VALUE!"},0.79654274638766465,{"$error":"#VALUE!"}]
["LA SOUTERRAINE","(Espace de l'Ecluse)",1,"+461411,0","+012927,0",{"$error":"#VALUE!"},0.80697722034360986,2.6019950265148029E-2,{"$error":"#VALUE!"},{"$error":"#VALUE!"},{"$error":"#VALUE!"},{"$error":"#VALUE!"},{"$error":"#VALUE!"},{"$error":"#VALUE!"},0.80529944361168027,{"$error":"#VALUE!"}]
["LAON","(Grandlup / La Grange Beaufort)",1,"+493621,0","+033530,0",{"$error":"#VALUE!"},0.86578511986219486,6.2686408967461152E-2,{"$error":"#VALUE!"},{"$error":"#VALUE!"},{"$error":"#VALUE!"},{"$error":"#VALUE!"},{"$error":"#VALUE!"},{"$error":"#VALUE!"},0.86412711104771345,{"$error":"#VALUE!"}]
["LE MANS",null,1,"+480101,0","+001146,0",{"$error":"#VALUE!"},0.83805377730273012,3.4227845886332224E-3,{"$error":"#VALUE!"},{"$error":"#VALUE!"},{"$error":"#VALUE!"},{"$error":"#VALUE!"},{"$error":"#VALUE!"},{"$error":"#VALUE!"},0.8363835667096009,{"$error":"#VALUE!"}]
["LIBOURNE",null,1,"+445328,0","-001443,0",{"$error":"#VALUE!"},0.78349769376747569,-4.2809048041970764E-3,{"$error":"#VALUE!"},{"$error":"#VALUE!"},{"$error":"#VALUE!"},{"$error":"#VALUE!"},{"$error":"#VALUE!"},{"$error":"#VALUE!"},0.78181849780696411,{"$error":"#VALUE!"}]
["LIMOGES",null,1,"+453303,0","+011215,0",{"$error":"#VALUE!"},0.79501201869382676,2.1016673076097763E-2,{"$error":"#VALUE!"},{"$error":"#VALUE!"},{"$error":"#VALUE!"},{"$error":"#VALUE!"},{"$error":"#VALUE!"},{"$error":"#VALUE!"},0.79333305607713966,{"$error":"#VALUE!"}]
{"$rows_left_out":25}
{"sheet":"lossingen kbdk 200321","index":2,"n_rows":225,"n_cols":4,"rows_kept":225,"cut":false,"hidden":false,"merged":[]}
["Coördinaten Lossingsplaatsen",null,"2021-03-20"]
[]
[]
["Frankrijk"]
["Westenlijn"]
["ARRAS","Port Fluvial",501751,24729]
["BOVES","Parking \"La Grenouillère\"",495047,22508]
["CLERMONT","Stade Verdier Breuil le Vert",492206,22557]
["EPEHY","Cour marchandises Gare SNCF",500053,30750]
["CHANTILLY","Parking de la Mère Marie",491127,22858]
["PONTOISE","Aérodrome de Pontoise",490633,20132]
["FONTENAY-SUR-EURE","Parking Mon Idée",482449,12558]
["L'AIGLE","Zone Industrielle 1, Parc Burat",484437,3833]
["Middenlijn"]
["NIERGES","Aérodrome de Cambrai",500816,31614]
["PERONNE",null,495533,25617]
["ST.-QUENTIN","Place de la Liberté",495023,31725]
["NOYON (Morlincourt)","Le Hameau",493339,30234]
["PONT STE.-MAXENCE","Le Port - Z.I. de Brenouille",491814,23442]
["ECOUEN","Site de l'AREP",490135,22451]
["Oostenlijn"]
["VERVINS","Parking supermarché",495023,35507]
["LAON (Bresny)","Route le Haute d'Aulnois"," +493621,0"," +033530,0"]
["SOISSONS","Le Pont Rouge - Margival",492526,32424]
["NANTEUIL","Chemin des Maisonnettes",490812,24636]
["COLLEGIEN (St Soupplets)","Parking Collège",490218,24854]
["DIZY-LE-GROS","Fond de Lappion",493728,40025]
["TRELOU S/MARNE","Les Meules",490419,33600]
["LA FERTE /S JOUARRE (Signy-Signets)","en face du Bâtiment agricole",485511,30233]
["LA FERTE ST. AUBIN","Zone Industrielle",474342,15534]
{"$rows_left_out":196}
{"sheet":"meters per minuut","index":3,"n_rows":60,"n_cols":10,"rows_kept":60,"cut":false,"hidden":false,"merged":[[0,8,0,9],[0,0,0,2],[0,4,0,5],[0,6,0,7]]}
[{"$f":"start!K10","v":0},null,null,null,{"$f":"VLOOKUP(A1,'berekening afstand'!A:P, 6,FALSE)","v":0},null,"Lossingsuur :",null,{"$f":"start!N10","v":"00:00:00"}]
[]
["m / m","aankomst","m / m","aankomst","m / m","aankomst","m / m","aankomst","m / m","aankomst"]
[2200,{"$f":"((E$1/A4)/60)/24+I$1","v":"00:00:00"},1920,{"$f":"((E$1/C4)/60)/24+I$1","v":"00:00:00"},1640,{"$f":"((E$1/E4)/60)/24+I$1","v":"00:00:00"},1360,{"$f":"((E$1/G4)/60)/24+I$1","v":"00:00:00"},1080,{"$f":"((E$1/I4)/60)/24+I$1","v":"00:00:00"}]
[2195,"00:00:00",1915,"00:00:00",1635,"00:00:00",1355,"00:00:00",1075,"00:00:00"]
[2190,"00:00:00",1910,"00:00:00",1630,"00:00:00",1350,"00:00:00",1070,"00:00:00"]
[2185,"00:00:00",1905,"00:00:00",1625,"00:00:00",1345,"00:00:00",1065,"00:00:00"]
[2180,"00:00:00",1900,"00:00:00",1620,"00:00:00",1340,"00:00:00",1060,"00:00:00"]
[2175,"00:00:00",1895,"00:00:00",1615,"00:00:00",1335,"00:00:00",1055,"00:00:00"]
[2170,"00:00:00",1890,"00:00:00",1610,"00:00:00",1330,"00:00:00",1050,"00:00:00"]
[2165,"00:00:00",1885,"00:00:00",1605,"00:00:00",1325,"00:00:00",1045,"00:00:00"]
[2160,"00:00:00",1880,"00:00:00",1600,"00:00:00",1320,"00:00:00",1040,"00:00:00"]
[2155,"00:00:00",1875,"00:00:00",1595,"00:00:00",1315,"00:00:00",1035,"00:00:00"]
[2150,"00:00:00",1870,"00:00:00",1590,"00:00:00",1310,"00:00:00",1030,"00:00:00"]
[2145,"00:00:00",1865,"00:00:00",1585,"00:00:00",1305,"00:00:00",1025,"00:00:00"]
[2140,"00:00:00",1860,"00:00:00",1580,"00:00:00",1300,"00:00:00",1020,"00:00:00"]
[2135,"00:00:00",1855,"00:00:00",1575,"00:00:00",1295,"00:00:00",1015,"00:00:00"]
[2130,"00:00:00",1850,"00:00:00",1570,"00:00:00",1290,"00:00:00",1010,"00:00:00"]
[2125,"00:00:00",1845,"00:00:00",1565,"00:00:00",1285,"00:00:00",1005,"00:00:00"]
[2120,"00:00:00",1840,"00:00:00",1560,"00:00:00",1280,"00:00:00",1000,"00:00:00"]
[2115,"00:00:00",1835,"00:00:00",1555,"00:00:00",1275,"00:00:00",995,"00:00:00"]
[2110,"00:00:00",1830,"00:00:00",1550,"00:00:00",1270,"00:00:00",990,"00:00:00"]
[2105,"00:00:00",1825,"00:00:00",1545,"00:00:00",1265,"00:00:00",985,"00:00:00"]
[2100,"00:00:00",1820,"00:00:00",1540,"00:00:00",1260,"00:00:00",980,"00:00:00"]
[2095,"00:00:00",1815,"00:00:00",1535,"00:00:00",1255,"00:00:00",975,"00:00:00"]
[2090,"00:00:00",1810,"00:00:00",1530,"00:00:00",1250,"00:00:00",970,"00:00:00"]
[2085,"00:00:00",1805,"00:00:00",1525,"00:00:00",1245,"00:00:00",965,"00:00:00"]
[2080,"00:00:00",1800,"00:00:00",1520,"00:00:00",1240,"00:00:00",960,"00:00:00"]
[2075,"00:00:00",1795,"00:00:00",1515,"00:00:00",1235,"00:00:00",955,"00:00:00"]
[2070,"00:00:00",1790,"00:00:00",1510,"00:00:00",1230,"00:00:00",950,"00:00:00"]
{"$rows_left_out":31}
{"sheet":"snelheidstabel","index":4,"n_rows":56,"n_cols":15,"rows_kept":56,"cut":false,"hidden":false,"merged":[[0,2,0,5],[0,7,0,9],[31,2,31,5],[31,7,31,9]]}
[{"$f":"TODAY()","v":"2021-03-20"},null,{"$f":"'berekening afstand'!$A$3","v":0},null,null,null,null,{"$f":"'berekening afstand'!$A$4","v":0},null,null,null,null,"00:00:00"]
[]
[null,null,2000,1900,1800,1700,1600,1500,1400,1300,1200,1100,1000,900,800]
[]
["GEMBLOUX",{"$f":"VLOOKUP(A5,'berekening afstand'!A:P, 6,FALSE)","v":{"$error":"#VALUE!"}},{"$f":"(($B5/C$3)/60)/24+$M$1","v":{"$error":"#VALUE!"}},{"$f":"(($B5/D$3)/60)/24+$M$1","v":{"$error":"#VALUE!"}},{"$error":"#VALUE!"},{"$error":"#VALUE!"},{"$error":"#VALUE!"},{"$error":"#VALUE!"},{"$error":"#VALUE!"},{"$error":"#VALUE!"},{"$error":"#VALUE!"},{"$error":"#VALUE!"},{"$error":"#VALUE!"},{"$error":"#VALUE!"},{"$error":"#VALUE!"}]
["FLEURUS",{"$f":"VLOOKUP(A6,'berekening afstand'!A:P, 6,FALSE)","v":{"$error":"#VALUE!"}},{"$error":"#VALUE!"},{"$error":"#VALUE!"},{"$error":"#VALUE!"},{"$error":"#VALUE!"},{"$error":"#VALUE!"},{"$error":"#VALUE!"},{"$error":"#VALUE!"},{"$error":"#VALUE!"},{"$error":"#VALUE!"},{"$error":"#VALUE!"},{"$error":"#VALUE!"},{"$error":"#VALUE!"},{"$error":"#VALUE!"}]
["MOMIGNIES",{"$f":"VLOOKUP(A7,'berekening afstand'!A:P, 6,FALSE)","v":{"$error":"#VALUE!"}},{"$f":"(($B7/C$3)/60)/24+$M$1","v":{"$error":"#VALUE!"}},{"$error":"#VALUE!"},{"$error":"#VALUE!"},{"$error":"#VALUE!"},{"$error":"#VALUE!"},{"$error":"#VALUE!"},{"$error":"#VALUE!"},{"$error":"#VALUE!"},{"$error":"#VALUE!"},{"$error":"#VALUE!"},{"$error":"#VALUE!"},{"$error":"#VALUE!"},{"$error":"#VALUE!"}]
["LAON",{"$f":"VLOOKUP(A8,'berekening afstand'!A:P, 6,FALSE)","v":{"$error":"#VALUE!"}},{"$f":"(($B8/C$3)/60)/24+$M$1","v":{"$error":"#VALUE!"}},{"$error":"#VALUE!"},{"$error":"#VALUE!"},{"$error":"#VALUE!"},{"$error":"#VALUE!"},{"$error":"#VALUE!"},{"$error":"#VALUE!"},{"$error":"#VALUE!"},{"$error":"#VALUE!"},{"$error":"#VALUE!"},{"$error":"#VALUE!"},{"$error":"#VALUE!"},{"$error":"#VALUE!"}]
["SOISSONS",{"$f":"VLOOKUP(A9,'berekening afstand'!A:P, 6,FALSE)","v":{"$error":"#VALUE!"}},{"$f":"(($B9/C$3)/60)/24+$M$1","v":{"$error":"#VALUE!"}},{"$error":"#VALUE!"},{"$error":"#VALUE!"},{"$error":"#VALUE!"},{"$error":"#VALUE!"},{"$error":"#VALUE!"},{"$error":"#VALUE!"},{"$error":"#VALUE!"},{"$error":"#VALUE!"},{"$error":"#VALUE!"},{"$error":"#VALUE!"},{"$error":"#VALUE!"},{"$error":"#VALUE!"}]
["NANTEUIL",{"$f":"VLOOKUP(A10,'berekening afstand'!A:P, 6,FALSE)","v":{"$error":"#VALUE!"}},{"$f":"(($B10/C$3)/60)/24+$M$1","v":{"$error":"#VALUE!"}},{"$error":"#VALUE!"},{"$error":"#VALUE!"},{"$error":"#VALUE!"},{"$error":"#VALUE!"},{"$error":"#VALUE!"},{"$error":"#VALUE!"},{"$error":"#VALUE!"},{"$error":"#VALUE!"},{"$error":"#VALUE!"},{"$error":"#VALUE!"},{"$error":"#VALUE!"},{"$error":"#VALUE!"}]
["MELUN",{"$f":"VLOOKUP(A11,'berekening afstand'!A:P, 6,FALSE)","v":{"$error":"#VALUE!"}},{"$f":"(($B11/C$3)/60)/24+$M$1","v":{"$error":"#VALUE!"}},{"$error":"#VALUE!"},{"$error":"#VALUE!"},{"$error":"#VALUE!"},{"$error":"#VALUE!"},{"$error":"#VALUE!"},{"$error":"#VALUE!"},{"$error":"#VALUE!"},{"$error":"#VALUE!"},{"$error":"#VALUE!"},{"$error":"#VALUE!"},{"$error":"#VALUE!"},{"$error":"#VALUE!"}]
["SENS",{"$f":"VLOOKUP(A12,'berekening afstand'!A:P, 6,FALSE)","v":{"$error":"#VALUE!"}},{"$f":"(($B12/C$3)/60)/24+$M$1","v":{"$error":"#VALUE!"}},{"$error":"#VALUE!"},{"$error":"#VALUE!"},{"$error":"#VALUE!"},{"$error":"#VALUE!"},{"$error":"#VALUE!"},{"$error":"#VALUE!"},{"$error":"#VALUE!"},{"$error":"#VALUE!"},{"$error":"#VALUE!"},{"$error":"#VALUE!"},{"$error":"#VALUE!"},{"$error":"#VALUE!"}]
["CHEVRAIN",{"$f":"VLOOKUP(A13,'berekening afstand'!A:P, 6,FALSE)","v":{"$error":"#VALUE!"}},{"$f":"(($B13/C$3)/60)/24+$M$1","v":{"$error":"#VALUE!"}},{"$error":"#VALUE!"},{"$error":"#VALUE!"},{"$error":"#VALUE!"},{"$error":"#VALUE!"},{"$error":"#VALUE!"},{"$error":"#VALUE!"},{"$error":"#VALUE!"},{"$error":"#VALUE!"},{"$error":"#VALUE!"},{"$error":"#VALUE!"},{"$error":"#VALUE!"},{"$error":"#VALUE!"}]
["SERMAISES",{"$f":"VLOOKUP(A14,'berekening afstand'!A:P, 6,FALSE)","v":{"$error":"#VALUE!"}},{"$error":"#VALUE!"},{"$error":"#VALUE!"},{"$error":"#VALUE!"},{"$error":"#VALUE!"},{"$error":"#VALUE!"},{"$error":"#VALUE!"},{"$error":"#VALUE!"},{"$error":"#VALUE!"},{"$error":"#VALUE!"},{"$error":"#VALUE!"},{"$error":"#VALUE!"},{"$error":"#VALUE!"},{"$error":"#VALUE!"}]
["PITHIVIERS",{"$f":"VLOOKUP(A15,'berekening afstand'!A:P, 6,FALSE)","v":{"$error":"#VALUE!"}},{"$f":"(($B15/C$3)/60)/24+$M$1","v":{"$error":"#VALUE!"}},{"$error":"#VALUE!"},{"$error":"#VALUE!"},{"$error":"#VALUE!"},{"$error":"#VALUE!"},{"$error":"#VALUE!"},{"$error":"#VALUE!"},{"$error":"#VALUE!"},{"$error":"#VALUE!"},{"$error":"#VALUE!"},{"$error":"#VALUE!"},{"$error":"#VALUE!"},{"$error":"#VALUE!"}]
["TOURY",{"$f":"VLOOKUP(A16,'berekening afstand'!A:P, 6,FALSE)","v":{"$error":"#VALUE!"}},{"$f":"(($B16/C$3)/60)/24+$M$1","v":{"$error":"#VALUE!"}},{"$error":"#VALUE!"},{"$error":"#VALUE!"},{"$error":"#VALUE!"},{"$error":"#VALUE!"},{"$error":"#VALUE!"},{"$error":"#VALUE!"},{"$error":"#VALUE!"},{"$error":"#VALUE!"},{"$error":"#VALUE!"},{"$error":"#VALUE!"},{"$error":"#VALUE!"},{"$error":"#VALUE!"}]
["FAY-AUX-LOGES",{"$f":"VLOOKUP(A17,'berekening afstand'!A:P, 6,FALSE)","v":{"$error":"#VALUE!"}},{"$f":"(($B17/C$3)/60)/24+$M$1","v":{"$error":"#VALUE!"}},{"$error":"#VALUE!"},{"$error":"#VALUE!"},{"$error":"#VALUE!"},{"$error":"#VALUE!"},{"$error":"#VALUE!"},{"$error":"#VALUE!"},{"$error":"#VALUE!"},{"$error":"#VALUE!"},{"$error":"#VALUE!"},{"$error":"#VALUE!"},{"$error":"#VALUE!"},{"$error":"#VALUE!"}]
["BLOIS",{"$f":"VLOOKUP(A18,'berekening afstand'!A:P, 6,FALSE)","v":{"$error":"#VALUE!"}},{"$f":"(($B18/C$3)/60)/24+$M$1","v":{"$error":"#VALUE!"}},{"$error":"#VALUE!"},{"$error":"#VALUE!"},{"$error":"#VALUE!"},{"$error":"#VALUE!"},{"$error":"#VALUE!"},{"$error":"#VALUE!"},{"$error":"#VALUE!"},{"$error":"#VALUE!"},{"$error":"#VALUE!"},{"$error":"#VALUE!"},{"$error":"#VALUE!"},{"$error":"#VALUE!"}]
["VIERZON",{"$f":"VLOOKUP(A19,'berekening afstand'!A:P, 6,FALSE)","v":{"$error":"#VALUE!"}},{"$f":"(($B19/C$3)/60)/24+$M$1","v":{"$error":"#VALUE!"}},{"$error":"#VALUE!"},{"$error":"#VALUE!"},{"$error":"#VALUE!"},{"$error":"#VALUE!"},{"$error":"#VALUE!"},{"$error":"#VALUE!"},{"$error":"#VALUE!"},{"$error":"#VALUE!"},{"$error":"#VALUE!"},{"$error":"#VALUE!"},{"$error":"#VALUE!"},{"$error":"#VALUE!"}]
["BOURGES",{"$f":"VLOOKUP(A20,'berekening afstand'!A:P, 6,FALSE)","v":{"$error":"#VALUE!"}},{"$f":"(($B20/C$3)/60)/24+$M$1","v":{"$error":"#VALUE!"}},{"$error":"#VALUE!"},{"$error":"#VALUE!"},{"$error":"#VALUE!"},{"$error":"#VALUE!"},{"$error":"#VALUE!"},{"$error":"#VALUE!"},{"$error":"#VALUE!"},{"$error":"#VALUE!"},{"$error":"#VALUE!"},{"$error":"#VALUE!"},{"$error":"#VALUE!"},{"$error":"#VALUE!"}]
["LE MANS",{"$f":"VLOOKUP(A21,'berekening afstand'!A:P, 6,FALSE)","v":{"$error":"#VALUE!"}},{"$f":"(($B21/C$3)/60)/24+$M$1","v":{"$error":"#VALUE!"}},{"$error":"#VALUE!"},{"$error":"#VALUE!"},{"$error":"#VALUE!"},{"$error":"#VALUE!"},{"$error":"#VALUE!"},{"$error":"#VALUE!"},{"$error":"#VALUE!"},{"$error":"#VALUE!"},{"$error":"#VALUE!"},{"$error":"#VALUE!"},{"$error":"#VALUE!"},{"$error":"#VALUE!"}]
["ISSOUDUN",{"$f":"VLOOKUP(A22,'berekening afstand'!A:P, 6,FALSE)","v":{"$error":"#VALUE!"}},{"$f":"(($B22/C$3)/60)/24+$M$1","v":{"$error":"#VALUE!"}},{"$error":"#VALUE!"},{"$error":"#VALUE!"},{"$error":"#VALUE!"},{"$error":"#VALUE!"},{"$error":"#VALUE!"},{"$error":"#VALUE!"},{"$error":"#VALUE!"},{"$error":"#VALUE!"},{"$error":"#VALUE!"},{"$error":"#VALUE!"},{"$error":"#VALUE!"},{"$error":"#VALUE!"}]
["MOULINS",{"$f":"VLOOKUP(A23,'berekening afstand'!A:P, 6,FALSE)","v":{"$error":"#VALUE!"}},{"$f":"(($B23/C$3)/60)/24+$M$1","v":{"$error":"#VALUE!"}},{"$error":"#VALUE!"},{"$error":"#VALUE!"},{"$error":"#VALUE!"},{"$error":"#VALUE!"},{"$error":"#VALUE!"},{"$error":"#VALUE!"},{"$error":"#VALUE!"},{"$error":"#VALUE!"},{"$error":"#VALUE!"},{"$error":"#VALUE!"},{"$error":"#VALUE!"},{"$error":"#VALUE!"}]
["CHATEAUROUX",{"$f":"VLOOKUP(A24,'berekening afstand'!A:P, 6,FALSE)","v":{"$error":"#VALUE!"}},{"$f":"(($B24/C$3)/60)/24+$M$1","v":{"$error":"#VALUE!"}},{"$error":"#VALUE!"},{"$error":"#VALUE!"},{"$error":"#VALUE!"},{"$error":"#VALUE!"},{"$error":"#VALUE!"},{"$error":"#VALUE!"},{"$error":"#VALUE!"},{"$error":"#VALUE!"},{"$error":"#VALUE!"},{"$error":"#VALUE!"},{"$error":"#VALUE!"},{"$error":"#VALUE!"}]
["TOURS",{"$f":"VLOOKUP(A25,'berekening afstand'!A:P, 6,FALSE)","v":{"$error":"#VALUE!"}},{"$f":"(($B25/C$3)/60)/24+$M$1","v":{"$error":"#VALUE!"}},{"$error":"#VALUE!"},{"$error":"#VALUE!"},{"$error":"#VALUE!"},{"$error":"#VALUE!"},{"$error":"#VALUE!"},{"$error":"#VALUE!"},{"$error":"#VALUE!"},{"$error":"#VALUE!"},{"$error":"#VALUE!"},{"$error":"#VALUE!"},{"$error":"#VALUE!"},{"$error":"#VALUE!"}]
["MONTLUCON",{"$f":"VLOOKUP(A26,'berekening afstand'!A:P, 6,FALSE)","v":{"$error":"#VALUE!"}},{"$f":"(($B26/C$3)/60)/24+$M$1","v":{"$error":"#VALUE!"}},{"$error":"#VALUE!"},{"$error":"#VALUE!"},{"$error":"#VALUE!"},{"$error":"#VALUE!"},{"$error":"#VALUE!"},{"$error":"#VALUE!"},{"$error":"#VALUE!"},{"$error":"#VALUE!"},{"$error":"#VALUE!"},{"$error":"#VALUE!"},{"$error":"#VALUE!"},{"$error":"#VALUE!"}]
["ARGENTON",{"$f":"VLOOKUP(A27,'berekening afstand'!A:P, 6,FALSE)","v":{"$error":"#VALUE!"}},{"$f":"(($B27/C$3)/60)/24+$M$1","v":{"$error":"#VALUE!"}},{"$error":"#VALUE!"},{"$error":"#VALUE!"},{"$error":"#VALUE!"},{"$error":"#VALUE!"},{"$error":"#VALUE!"},{"$error":"#VALUE!"},{"$error":"#VALUE!"},{"$error":"#VALUE!"},{"$error":"#VALUE!"},{"$error":"#VALUE!"},{"$error":"#VALUE!"},{"$error":"#VALUE!"}]
["VICHY",{"$f":"VLOOKUP(A28,'berekening afstand'!A:P, 6,FALSE)","v":{"$error":"#VALUE!"}},{"$f":"(($B28/C$3)/60)/24+$M$1","v":{"$error":"#VALUE!"}},{"$error":"#VALUE!"},{"$error":"#VALUE!"},{"$error":"#VALUE!"},{"$error":"#VALUE!"},{"$error":"#VALUE!"},{"$error":"#VALUE!"},{"$error":"#VALUE!"},{"$error":"#VALUE!"},{"$error":"#VALUE!"},{"$error":"#VALUE!"},{"$error":"#VALUE!"},{"$error":"#VALUE!"}]
["GUERET",{"$f":"VLOOKUP(A29,'berekening afstand'!A:P, 6,FALSE)","v":{"$error":"#VALUE!"}},{"$f":"(($B29/C$3)/60)/24+$M$1","v":{"$error":"#VALUE!"}},{"$error":"#VALUE!"},{"$error":"#VALUE!"},{"$error":"#VALUE!"},{"$error":"#VALUE!"},{"$error":"#VALUE!"},{"$error":"#VALUE!"},{"$error":"#VALUE!"},{"$error":"#VALUE!"},{"$error":"#VALUE!"},{"$error":"#VALUE!"},{"$error":"#VALUE!"},{"$error":"#VALUE!"}]
["LA SOUTERRAINE",{"$f":"VLOOKUP(A30,'berekening afstand'!A:P, 6,FALSE)","v":{"$error":"#VALUE!"}},{"$error":"#VALUE!"},{"$error":"#VALUE!"},{"$error":"#VALUE!"},{"$error":"#VALUE!"},{"$error":"#VALUE!"},{"$error":"#VALUE!"},{"$error":"#VALUE!"},{"$error":"#VALUE!"},{"$error":"#VALUE!"},{"$error":"#VALUE!"},{"$error":"#VALUE!"},{"$error":"#VALUE!"},{"$error":"#VALUE!"}]
{"$rows_left_out":26}